# Make: Python Error

**URL:** <https://forum.collaboraonline.com/t/make-python-error/124>\
**Category:** Development\
**Created:** [January 5, 2021, 10:31am UTC](https://forum.collaboraonline.com/t/make-python-error/124 "2021-01-05T10:31:28Z")\
**Posts on this page:** 4\
**Page:** 1

<div class="post-metadata">

**Author:** ![pedro.silva](https://dub1.discourse-cdn.com/flex013/user_avatar/forum.collaboraonline.com/pedro.silva/32/4_2.png) [@pedro.silva](https://forum.collaboraonline.com/u/pedro.silva)\
**Post date:** [January 5, 2021, 10:31am UTC](https://forum.collaboraonline.com/t/make-python-error/124/1 "2021-01-05T10:31:28Z")

</div>

If you are getting an error when running `make` similar to

```bash
/home/pedro/online/scripts/unocommands.py --check /home/pedro/online
Traceback (most recent call last):
  File "/home/pedro/online/scripts/unocommands.py", line 13, in <module>
    from lxml import etree
ImportError: /usr/lib64/python3.6/site-packages/lxml/etree.cpython-36m-x86_64-linux-gnu.so: undefined symbol: PyFPE_jbuf

```

Please check if you do not have important Python updates. This was my case, where python3-lxml was not yet updated (openSUSE Leap 15.2).

After doing the appropriated updates on your package manager the build should work properly afterwards.

---

<div class="post-metadata">

**Author:** ![ChimaOmeje](https://dub1.discourse-cdn.com/flex013/user_avatar/forum.collaboraonline.com/chimaomeje/32/1559_2.png) [@ChimaOmeje](https://forum.collaboraonline.com/u/ChimaOmeje)\
**Post date:** [February 20, 2025, 8:51pm UTC](https://forum.collaboraonline.com/t/make-python-error/124/2 "2025-02-20T20:51:59Z")

</div>

Hi pedro I ended up configuring my file within a Python virtual environment , because the python3-lxml was producing a similar error. Everything was configured and works however when i enter \> " ```

> make -j $(nproc)"

I get a bunch of errors. Here is the excerpt of my error logs

```auto
make[2]: *** [Makefile:3585: kit/KitQueue.o] Error 1
make[2]: *** Waiting for unfinished jobs....
make[2]: *** [Makefile:3585: common/Unit.o] Error 1
make[2]: *** [Makefile:3585: kit/KitWebSocket.o] Error 1
make[2]: *** [Makefile:3585: kit/ChildSession.o] Error 1
make[2]: *** [Makefile:3585: kit/Kit.o] Error 1
make[2]: Leaving directory '/home/chima/collabora-online'
make[1]: *** [Makefile:7811: all-recursive] Error 1
make[1]: Leaving directory '/home/chima/collabora-online'
make: *** [Makefile:2147: all] Error 2
(cool-env) chima@chima-HP-Laptop-15-dw3xxx:~/collabora-online$

```

```auto

```

---

<div class="post-metadata">

**Author:** ![ChimaOmeje](https://dub1.discourse-cdn.com/flex013/user_avatar/forum.collaboraonline.com/chimaomeje/32/1559_2.png) [@ChimaOmeje](https://forum.collaboraonline.com/u/ChimaOmeje)\
**Post date:** [February 20, 2025, 9:18pm UTC](https://forum.collaboraonline.com/t/make-python-error/124/3 "2025-02-20T21:18:34Z")

</div>

I think I found the error. POCO was not installed properly so the make file was not working.

---

<div class="post-metadata">

**Author:** ![darshan](https://dub1.discourse-cdn.com/flex013/user_avatar/forum.collaboraonline.com/darshan/32/2230_2.png) [@darshan](https://forum.collaboraonline.com/u/darshan)\
**Post date:** [February 27, 2025, 7:18am UTC](https://forum.collaboraonline.com/t/make-python-error/124/4 "2025-02-27T07:18:07Z")

</div>


